Target
Bifunctional epoxide hydrolase 2
Ligand
BDBM50068107
Substrate
Meas. Tech.
ChEMBL_2214223 (CHEMBL5127355)
IC50
79000±n/a nM
Citation
 de Esch, IJPErlanson, DAJahnke, WJohnson, CNWalsh, L Fragment-to-Lead Medicinal Chemistry Publications in 2020. J Med Chem 65:84-99 (2022) Target
Name:
Bifunctional epoxide hydrolase 2
Synonyms:
Cytosolic epoxide hydrolase 2 EPHX2 HYES_HUMAN Soluble epoxide hydrolase (sEH) | epoxide hydrolase 2, cytoplasmic
Type:
Enzyme
Mol. Mass.:
62613.07
Organism:
Homo sapiens (Human)
Description:
P34913
Residue:
555
  
Inhibitor
Name:
BDBM50068107
Synonyms:
CHEMBL3402237
Type:
Small organic molecule
Emp. Form.:
C16H18O2
Mol. Mass.:
242.3129
SMILES:
OCCCc1ccc(OCc2ccccc2)cc1
: