Target
Dual specificity protein kinase CLK4
Ligand
BDBM50347746
Substrate
Meas. Tech.
ChEMBL_2214237 (CHEMBL5127369)
IC50
18±n/a nM
Citation
 Tahtouh, TDurieu, EVilliers, BBruyère, CNguyen, TLFant, XAhn, KHKhurana, LDeau, ELindberg, MFSévère, EMiege, FRoche, DLimanton, EL'Helgoual'ch, JMBurgy, GGuiheneuf, SHerault, YKendall, DACarreaux, FBazureau, JPMeijer, L Structure-Activity Relationship in the Leucettine Family of Kinase Inhibitors. J Med Chem 65:1396-1417 (2022) Target
Name:
Dual specificity protein kinase CLK4
Synonyms:
CDC-like kinase 4 Clk4
Type:
PROTEIN
Mol. Mass.:
57374.39
Organism:
Mus musculus
Description:
ChEMBL_1502248
Residue:
481
  
Inhibitor
Name:
BDBM50347746
Synonyms:
CHEMBL1803085
Type:
Small organic molecule
Emp. Form.:
C17H13N3O4
Mol. Mass.:
323.3028
SMILES:
Oc1ccc(NC2=NC(=Cc3ccc4OCOc4c3)C(=O)N2)cc1
: