Target
Dual specificity tyrosine-phosphorylation-regulated kinase 1A
Ligand
BDBM50347745
Substrate
Meas. Tech.
ChEMBL_2214245 (CHEMBL5127377)
IC50
18±n/a nM
Citation
 Tahtouh, TDurieu, EVilliers, BBruyère, CNguyen, TLFant, XAhn, KHKhurana, LDeau, ELindberg, MFSévère, EMiege, FRoche, DLimanton, EL'Helgoual'ch, JMBurgy, GGuiheneuf, SHerault, YKendall, DACarreaux, FBazureau, JPMeijer, L Structure-Activity Relationship in the Leucettine Family of Kinase Inhibitors. J Med Chem 65:1396-1417 (2022) Target
Name:
Dual specificity tyrosine-phosphorylation-regulated kinase 1A
Synonyms:
DYR1A_HUMAN DYRK1A Dual specificity YAK1-related kinase 1A (Dyrk1A) Dual-specificity tyrosine-phosphorylation regulated kinase 1A HP86 MNBH
Type:
Enzyme
Mol. Mass.:
85616.61
Organism:
Homo sapiens (Human)
Description:
Q13627
Residue:
763
  
Inhibitor
Name:
BDBM50347745
Synonyms:
CHEMBL1803084
Type:
Small organic molecule
Emp. Form.:
C18H15N3O3
Mol. Mass.:
321.33
SMILES:
Cc1ccc(NC2=NC(=Cc3ccc4OCOc4c3)C(=O)N2)cc1
: