Target
Sodium-dependent noradrenaline transporter
Ligand
BDBM50164473
Substrate
Meas. Tech.
ChEMBL_303772 (CHEMBL830129)
Ki
219±n/a nM
Citation
 Jarkas, NMcConathy, JVoll, RJGoodman, MM Synthesis, in vitro characterization, and radiolabeling of N,N-dimethyl-2-(2'-amino-4'-substituted-phenylthio)benzylamines: potential candidates as selective serotonin transporter radioligands. J Med Chem 48:4254-65 (2005)  
Target
Name:
Sodium-dependent noradrenaline transporter
Synonyms:
Monoamine transporter NET Noradrenaline Transporter (NET) Norepinephrine transporter protein (NET) SLC6A2 Sodium-dependent noradrenaline transporter (NET) | Solute carrier family 6 member 2
Type:
Multi-pass membrane protein
Mol. Mass.:
69337.72
Organism:
Homo sapiens (Human)
Description:
P23975
Residue:
617
  
Inhibitor
Name:
BDBM50164473
Synonyms:
2-(2-Dimethylaminomethyl-phenylsulfanyl)-5-(3-fluoro-propyl)-phenylamine N-(2-{[2-amino-4-(3-fluoropropyl)phenyl]thio}benzyl)-N,N-dimethylamine
Type:
Small organic molecule
Emp. Form.:
C18H23FN2S
Mol. Mass.:
318.452
SMILES:
CN(C)Cc1ccccc1Sc1ccc(CCCF)cc1N
: