Target
Sodium-dependent dopamine transporter
Ligand
BDBM50164473
Substrate
Meas. Tech.
ChEMBL_303756 (CHEMBL829799)
Ki
>5000±n/a nM
Citation
 Jarkas, NMcConathy, JVoll, RJGoodman, MM Synthesis, in vitro characterization, and radiolabeling of N,N-dimethyl-2-(2'-amino-4'-substituted-phenylthio)benzylamines: potential candidates as selective serotonin transporter radioligands. J Med Chem 48:4254-65 (2005)  
Target
Name:
Sodium-dependent dopamine transporter
Synonyms:
DA transporter DAT1 Dopamine transporter protein (DAT) SC6A3_HUMAN Sodium-dependent dopamine transporter Solute carrier family 6 member 3
Type:
Multi-pass membrane protein
Mol. Mass.:
68497.11
Organism:
Homo sapiens (Human)
Description:
Q01959
Residue:
620
  
Inhibitor
Name:
BDBM50164473
Synonyms:
2-(2-Dimethylaminomethyl-phenylsulfanyl)-5-(3-fluoro-propyl)-phenylamine N-(2-{[2-amino-4-(3-fluoropropyl)phenyl]thio}benzyl)-N,N-dimethylamine
Type:
Small organic molecule
Emp. Form.:
C18H23FN2S
Mol. Mass.:
318.452
SMILES:
CN(C)Cc1ccccc1Sc1ccc(CCCF)cc1N
: