Target
Integrase
Ligand
BDBM50595032
Substrate
Meas. Tech.
ChEMBL_2215247 (CHEMBL5128379)
Ki
130±n/a nM
Citation
 Simone, MIWood, ACampkin, DKiefel, MJHouston, TA Recent results from non-basic glycosidase inhibitors: How structural diversity can inform general strategies for improving inhibition potency. Eur J Med Chem 235:0 (2022) Target
Name:
Integrase
Synonyms:
Human immunodeficiency virus type 1 integrase
Type:
PROTEIN
Mol. Mass.:
32231.48
Organism:
Human immunodeficiency virus 1
Description:
ChEMBL_90865
Residue:
288
  
Inhibitor
Name:
BDBM50595032
Synonyms:
CHEMBL5178418
Type:
Small organic molecule
Emp. Form.:
C15H12ClN5O6S2
Mol. Mass.:
457.869
SMILES:
OS(=O)(=O)c1cccc(Nc2nc(Cl)nc(Nc3cccc(c3)S(O)(=O)=O)n2)c1
: