Target
Cathepsin K
Ligand
BDBM50169488
Substrate
Meas. Tech.
ChEMBL_306560 (CHEMBL829135)
IC50
130±n/a nM
Citation
 Barrett, DGBoncek, VMCatalano, JGDeaton, DNHassell, AMJurgensen, CHLong, STMcFadyen, RBMiller, ABMiller, LRPayne, JARay, JASamano, VShewchuk, LMTavares, FXWells-Knecht, KJWillard, DHWright, LLZhou, HQ P2-P3 conformationally constrained ketoamide-based inhibitors of cathepsin K. Bioorg Med Chem Lett 15:3540-6 (2005)  
Target
Name:
Cathepsin K
Synonyms:
CATK_HUMAN CTSO Cathepsin O Cathepsin X
Type:
Enzyme
Mol. Mass.:
36975.68
Organism:
Homo sapiens (Human)
Description:
P43235
Residue:
329
  
Inhibitor
Name:
BDBM50169488
Synonyms:
(1R)-2,2-DIMETHYL-1-({5-[4-(TRIFLUOROMETHYL)PHENYL]-1,3,4-OXADIAZOL-2-YL}METHYL)PROPYL (1S)-1-{OXO[(2-OXO-1,3-OXAZOLIDIN-3-YL)AMINO]ACETYL}PENTYLCARBAMATE CHEMBL365822 | [(S)-1-(2-Oxo-oxazolidin-3-ylaminooxalyl)-pentyl]-carbamic acid (R)-2,2-dimethyl-1-[5-(4-trifluoromethyl-phenyl)-[1,3,4]oxadiazol-2-ylmethyl]-propyl ester
Type:
Small organic molecule
Emp. Form.:
C26H32F3N5O7
Mol. Mass.:
583.5568
SMILES:
CCCC[C@H](NC(=O)O[C@H](Cc1nnc(o1)-c1ccc(cc1)C(F)(F)F)C(C)(C)C)C(=O)C(=O)NN1CCOC1=O
: