Target
Beta-2 adrenergic receptor
Ligand
BDBM50421717
Substrate
Meas. Tech.
ChEMBL_2216225 (CHEMBL5129357)
Kd
6.8±n/a nM
Citation
 Liang, QShi, BYao, QWang, TJi, XZhang, YWang, JZhao, X Early potential evaluation of lead compounds from a DNA-encoded library by the determination of their thermodynamics through a chromatographic method based on immobilized ? Bioorg Med Chem 68:0 (2022) Target
Name:
Beta-2 adrenergic receptor
Synonyms:
ADRB2 ADRB2_HUMAN Beta-2 adrenoceptor | Beta-2 adrenoreceptor
Type:
Mol. Mass.:
46461.69
Organism:
Homo sapiens (Human)
Description:
P07550
Residue:
413
  
Inhibitor
Name:
BDBM50421717
Synonyms:
TULOBUTEROL | Tulobuterol Hydrochloride
Type:
Small organic molecule
Emp. Form.:
C12H18ClNO
Mol. Mass.:
227.73
SMILES:
CC(C)(C)NCC(O)c1ccccc1Cl
: