Target
5-hydroxytryptamine receptor 2A
Ligand
BDBM50108690
Substrate
Meas. Tech.
ChEMBL_302343 (CHEMBL828927)
Ki
0.18±n/a nM
Citation
 Fish, LRGilligan, MTHumphries, ACIvarsson, MLadduwahetty, TMerchant, KJO'Connor, DPatel, SPhilipps, EVargas, HMHutson, PHMacLeod, AM 4-Fluorosulfonylpiperidines: selective 5-HT2A ligands for the treatment of insomnia. Bioorg Med Chem Lett 15:3665-9 (2005)  
Target
Name:
5-hydroxytryptamine receptor 2A
Synonyms:
5-HT-2A 5-HT2A 5-hydroxytryptamine receptor 2A (5HT2A) Htr2 Serotonin Receptor 2A
Type:
G Protein-Coupled Receptor (GPCR)
Mol. Mass.:
52852.05
Organism:
Rattus norvegicus (rat)
Description:
Rat cortex membranes 5-HT2A receptors.
Residue:
471
  
Inhibitor
Name:
BDBM50108690
Synonyms:
1-(2,4-difluorophenethyl)-4-(phenylsulfonyl)piperidine CHEMBL145939
Type:
Small organic molecule
Emp. Form.:
C19H21F2NO2S
Mol. Mass.:
365.437
SMILES:
Fc1ccc(CCN2CCC(CC2)S(=O)(=O)c2ccccc2)c(F)c1
: