Target
C-X-C chemokine receptor type 3
Ligand
BDBM208679
Substrate
Meas. Tech.
ChEMBL_2216805 (CHEMBL5129937)
IC50
561±n/a nM
Citation
 Meyer, EAÄänismaa, PFroidevaux, SKeller, MPiali, LCaroff, E Discovery and  J Med Chem 65:11513-11532 (2022) Target
Name:
C-X-C chemokine receptor type 3
Synonyms:
AAO92295.1 C-X-C chemokine receptor type 3 (CXCR3) CXCR3 CXCR3_HUMAN chemokine (C-X-C motif) receptor 3
Type:
Enzyme Catalytic Domain
Mol. Mass.:
40665.65
Organism:
Homo sapiens (Human)
Description:
Residue:
368
  
Inhibitor
Name:
BDBM208679
Synonyms:
US9266876, 146
Type:
Small organic molecule
Emp. Form.:
C25H26N8OS
Mol. Mass.:
486.592
SMILES:
CCc1nc(-c2nc3ccccc3[nH]2)c(s1)N1CCN([C@H](C)C1)C(=O)Cn1cnc2cccnc12
: