Target
Potassium voltage-gated channel subfamily H member 2
Ligand
BDBM208679
Substrate
Meas. Tech.
ChEMBL_2216807 (CHEMBL5129939)
IC50
960±n/a nM
Citation
 Meyer, EAÄänismaa, PFroidevaux, SKeller, MPiali, LCaroff, E Discovery and  J Med Chem 65:11513-11532 (2022) Target
Name:
Potassium voltage-gated channel subfamily H member 2
Synonyms:
1,3-beta-glucan synthase component GLS2 ERG Eag-related protein 1 Ether-a-go-go-related gene (HERG) Ether-a-go-go-related gene potassium channel 1 Ether-a-go-go-related gene potassium channel 1 (hERG1) Ether-a-go-go-related protein 1 H-ERG KCNH2 Potassium voltage-gated channel subfamily H member 2 (hERG) Voltage-gated potassium channel subunit Kv11.1 hERG Potassium Channel 1 | putative potassium channel subunit
Type:
Multi-pass membrane protein
Mol. Mass.:
126672.65
Organism:
Homo sapiens (Human)
Description:
Q12809
Residue:
1159
  
Inhibitor
Name:
BDBM208679
Synonyms:
US9266876, 146
Type:
Small organic molecule
Emp. Form.:
C25H26N8OS
Mol. Mass.:
486.592
SMILES:
CCc1nc(-c2nc3ccccc3[nH]2)c(s1)N1CCN([C@H](C)C1)C(=O)Cn1cnc2cccnc12
: