Target
Macrophage metalloelastase
Ligand
BDBM50170211
Substrate
Meas. Tech.
ChEMBL_306214 (CHEMBL831123)
IC50
180±n/a nM
Citation
 Dublanchet, ACDucrot, PAndrianjara, CO'Gara, MMorales, RCompère, DDenis, ABlais, SCluzeau, PCourté, KHamon, JMoreau, FPrunet, MLTertre, A Structure-based design and synthesis of novel non-zinc chelating MMP-12 inhibitors. Bioorg Med Chem Lett 15:3787-90 (2005)  
Target
Name:
Macrophage metalloelastase
Synonyms:
HME MMP12_HUMAN Matrix metalloproteinase-12 (MMP 12) Matrix metalloproteinase-12 (MMP12) | Matrix metalloproteinases 12 (MMP-12)
Type:
Enzyme
Mol. Mass.:
54012.99
Organism:
Homo sapiens (Human)
Description:
P39900
Residue:
470
  
Inhibitor
Name:
BDBM50170211
Synonyms:
(R)-Phenyl-{[4-(4-trifluoromethoxy-phenyl)-thiophene-2-carbonyl]-amino}-acetic acid | CHEMBL178652
Type:
Small organic molecule
Emp. Form.:
C20H14F3NO4S
Mol. Mass.:
421.39
SMILES:
OC(=O)[C@H](NC(=O)c1cc(cs1)-c1ccc(OC(F)(F)F)cc1)c1ccccc1
: