Target
Neuronal acetylcholine receptor subunit alpha-7
Ligand
BDBM50099564
Substrate
Meas. Tech.
ChEMBL_303326 (CHEMBL840051)
Ki
>100000±n/a nM
Citation
 Papke, RLZheng, GHorenstein, NADwoskin, LPCrooks, PA The characterization of a novel rigid nicotine analog with alpha7-selective nAChR agonist activity and modulation of agonist properties by boron inclusion. Bioorg Med Chem Lett 15:3874-80 (2005)  
Target
Name:
Neuronal acetylcholine receptor subunit alpha-7
Synonyms:
ACHA7_RAT Cholinergic, Nicotinic Alpha7 Chrna7 Neuronal acetylcholine receptor (alpha7 nAChR) Neuronal acetylcholine receptor subunit alpha-7 Neuronal acetylcholine receptor subunit alpha-7 (nAChR)
Type:
Enzyme
Mol. Mass.:
56502.44
Organism:
Rattus norvegicus (Rat)
Description:
Q05941
Residue:
502
  
Inhibitor
Name:
BDBM50099564
Synonyms:
(3aR,9bS)-1-Methyl-2,3,3a,4,5,9b-hexahydro-1H-pyrrolo[2,3-f]quinoline | CHEMBL281410
Type:
Small organic molecule
Emp. Form.:
C12H16N2
Mol. Mass.:
188.2688
SMILES:
CN1CC[C@H]2CCc3ncccc3[C@@H]12
: