Target
Methionine aminopeptidase
Ligand
BDBM50170373
Substrate
Meas. Tech.
ChEMBL_304984 (CHEMBL829421)
IC50
97±n/a nM
Citation
 Cui, YMHuang, QQXu, JChen, LLLi, JYYe, QZLi, JNan, FJ Identification of potent type I MetAPs inhibitors by simple bioisosteric replacement. Part 2: SAR studies of 5-heteroalkyl substituted TCAT derivatives. Bioorg Med Chem Lett 15:4130-5 (2005)  
Target
Name:
Methionine aminopeptidase
Synonyms:
EcMetAP Methionine Aminopeptidase (MAP) Peptidase M | map
Type:
Enzyme
Mol. Mass.:
29326.96
Organism:
Escherichia coli (strain K12)
Description:
Full-length untagged EcMAP was expressed in E. coli.
Residue:
264
  
Inhibitor
Name:
BDBM50170373
Synonyms:
5-Methoxymethyl-thiazole-4-carboxylic acid thiazol-2-ylamide | CHEMBL365124
Type:
Small organic molecule
Emp. Form.:
C9H9N3O2S2
Mol. Mass.:
255.317
SMILES:
COCc1scnc1C(=O)Nc1nccs1
: