Target
cGMP-specific 3',5'-cyclic phosphodiesterase
Ligand
BDBM50170531
Substrate
Meas. Tech.
ChEMBL_304989 (CHEMBL828602)
IC50
620±n/a nM
Citation
 Dan, AShiyama, TYamazaki, KKusunose, NFujita, KSato, HMatsui, KKitano, M Discovery of hydroxamic acid analogs as dual inhibitors of phosphodiesterase-1 and -5. Bioorg Med Chem Lett 15:4085-90 (2005)  
Target
Name:
cGMP-specific 3',5'-cyclic phosphodiesterase
Synonyms:
3',5'-cyclic phosphodiesterase PDE5 PDE5A_HUMAN Phosphodiesterase 5 (PDE5) Phosphodiesterase 5A (PDE5A) cGMP-specific 3',5'-cyclic phosphodiesterase
Type:
Protein
Mol. Mass.:
99975.83
Organism:
Homo sapiens (Human)
Description:
O76074
Residue:
875
  
Inhibitor
Name:
BDBM50170531
Synonyms:
6-Phenoxymethyl-pyridine-2-carboxylic acid [4-(1-hydroxycarbamoyl-3-methyl-butyl)-thiazol-2-yl]-amide | CHEMBL362580
Type:
Small organic molecule
Emp. Form.:
C22H24N4O4S
Mol. Mass.:
440.515
SMILES:
CC(C)CC(C(=O)NO)c1csc(NC(=O)c2cccc(COc3ccccc3)n2)n1
: