Target
cGMP-specific 3',5'-cyclic phosphodiesterase
Ligand
BDBM50170514
Substrate
Meas. Tech.
ChEMBL_304989 (CHEMBL828602)
IC50
230±n/a nM
Citation
 Dan, AShiyama, TYamazaki, KKusunose, NFujita, KSato, HMatsui, KKitano, M Discovery of hydroxamic acid analogs as dual inhibitors of phosphodiesterase-1 and -5. Bioorg Med Chem Lett 15:4085-90 (2005)  
Target
Name:
cGMP-specific 3',5'-cyclic phosphodiesterase
Synonyms:
3',5'-cyclic phosphodiesterase PDE5 PDE5A_HUMAN Phosphodiesterase 5 (PDE5) Phosphodiesterase 5A (PDE5A) cGMP-specific 3',5'-cyclic phosphodiesterase
Type:
Protein
Mol. Mass.:
99975.83
Organism:
Homo sapiens (Human)
Description:
O76074
Residue:
875
  
Inhibitor
Name:
BDBM50170514
Synonyms:
6-Phenoxymethyl-pyridine-2-carboxylic acid [4-(1-hydroxycarbamoyl-heptyl)-thiazol-2-yl]-amide | CHEMBL439667
Type:
Small organic molecule
Emp. Form.:
C24H28N4O4S
Mol. Mass.:
468.569
SMILES:
CCCCCCC(C(=O)NO)c1csc(NC(=O)c2cccc(COc3ccccc3)n2)n1
: