Target
cGMP-specific 3',5'-cyclic phosphodiesterase
Ligand
BDBM50170539
Substrate
Meas. Tech.
ChEMBL_304989 (CHEMBL828602)
IC50
630±n/a nM
Citation
 Dan, AShiyama, TYamazaki, KKusunose, NFujita, KSato, HMatsui, KKitano, M Discovery of hydroxamic acid analogs as dual inhibitors of phosphodiesterase-1 and -5. Bioorg Med Chem Lett 15:4085-90 (2005)  
Target
Name:
cGMP-specific 3',5'-cyclic phosphodiesterase
Synonyms:
3',5'-cyclic phosphodiesterase PDE5 PDE5A_HUMAN Phosphodiesterase 5 (PDE5) Phosphodiesterase 5A (PDE5A) cGMP-specific 3',5'-cyclic phosphodiesterase
Type:
Protein
Mol. Mass.:
99975.83
Organism:
Homo sapiens (Human)
Description:
O76074
Residue:
875
  
Inhibitor
Name:
BDBM50170539
Synonyms:
9-[3-(4-Acetyl-2-ethyl-5-hydroxy-phenoxymethyl)-benzoylamino]-nonanoic acid | CHEMBL190423
Type:
Small organic molecule
Emp. Form.:
C27H35NO6
Mol. Mass.:
469.5699
SMILES:
CCc1cc(C(C)=O)c(O)cc1OCc1cccc(c1)C(=O)NCCCCCCCCC(O)=O
: