Target
Carbonic anhydrase 9
Ligand
BDBM50170753
Substrate
Meas. Tech.
ChEMBL_302177 (CHEMBL830080)
Ki
38±n/a nM
Citation
 Cecchi, AHulikova, APastorek, JPastoreková, SScozzafava, AWinum, JYMontero, JLSupuran, CT Carbonic anhydrase inhibitors. Design of fluorescent sulfonamides as probes of tumor-associated carbonic anhydrase IX that inhibit isozyme IX-mediated acidification of hypoxic tumors. J Med Chem 48:4834-41 (2005)  
Target
Name:
Carbonic anhydrase 9
Synonyms:
CA-IX CAH9_HUMAN Carbonic anhydrase 9 (CA IX) Carbonic anhydrase 9 precursor Carbonic anhydrase IX (CAIX) Carbonic anhydrases; II & IX MN RCC-associated antigen G250
Type:
Enzyme
Mol. Mass.:
49669.03
Organism:
Homo sapiens (Human)
Description:
Catalytic domain of human cloned isozyme was used in the assay
Residue:
459
  
Inhibitor
Name:
BDBM50170753
Synonyms:
2,4,5-Trimethyl-1-(4-sulfamoyl-benzyl)-pyridinium; perchlorate | CHEMBL188750
Type:
Small organic molecule
Emp. Form.:
C15H19N2O2S
Mol. Mass.:
291.388
SMILES:
Cc1cc(C)[n+](Cc2ccc(cc2)S(N)(=O)=O)cc1C
: