Target
Carbonic anhydrase 2
Ligand
BDBM50170758
Substrate
Meas. Tech.
ChEMBL_302178 (CHEMBL830081)
Ki
34±n/a nM
Citation
 Cecchi, AHulikova, APastorek, JPastoreková, SScozzafava, AWinum, JYMontero, JLSupuran, CT Carbonic anhydrase inhibitors. Design of fluorescent sulfonamides as probes of tumor-associated carbonic anhydrase IX that inhibit isozyme IX-mediated acidification of hypoxic tumors. J Med Chem 48:4834-41 (2005)  
Target
Name:
Carbonic anhydrase 2
Synonyms:
CA-II CAC Carbonate dehydratase II Carbonic anhydrase 2 (CA-II) Carbonic anhydrase C Carbonic anhydrase II (CA-II) Carbonic anhydrase II (hCA II) | Carbonic anhydrase isoenzyme II (hCA II)
Type:
Enzyme
Mol. Mass.:
29250.71
Organism:
Homo sapiens (Human)
Description:
P00918
Residue:
260
  
Inhibitor
Name:
BDBM50170758
Synonyms:
2-(6-Hydroxy-3-oxo-3H-xanthen-9-yl)-5-{3-[4-(4-sulfamoyl-benzylsulfamoyl)-phenyl]-thioureido}-benzoic acid | CHEMBL360604
Type:
Small organic molecule
Emp. Form.:
C34H26N4O9S3
Mol. Mass.:
730.787
SMILES:
NS(=O)(=O)c1ccc(CNS(=O)(=O)c2ccc(NC(=S)Nc3ccc(c(c3)C(O)=O)-c3c4ccc(O)cc4oc4cc(=O)ccc34)cc2)cc1
: