Target
Adenosine receptor A1
Ligand
BDBM50170833
Substrate
Meas. Tech.
ChEMBL_302291 (CHEMBL830308)
Ki
1.7±n/a nM
Citation
 Perreira, MJiang, JKKlutz, AMGao, ZGShainberg, ALu, CThomas, CJJacobson, KA "Reversine" and its 2-substituted adenine derivatives as potent and selective A3 adenosine receptor antagonists. J Med Chem 48:4910-8 (2005)  
Target
Name:
Adenosine receptor A1
Synonyms:
A1 adenosine receptor (hA1) AA1R_HUMAN ADORA1 Adenosine A1-receptor Adenosine receptor A1 (hA1) | Adenosine transporter (AdT)
Type:
G Protein-Coupled Receptor (GPCR)
Mol. Mass.:
36520.92
Organism:
Homo sapiens (Human)
Description:
P30542
Residue:
326
  
Inhibitor
Name:
BDBM50170833
Synonyms:
5-[8-(Isopropyl-methyl-amino)-9-methyl-9H-purin-6-ylamino]-bicyclo[2.2.1]heptan-2-ol | CHEMBL363129
Type:
Small organic molecule
Emp. Form.:
C17H26N6O
Mol. Mass.:
330.4279
SMILES:
CC(C)N(C)c1nc2c(NC3CC4CC3CC4O)ncnc2n1C
: