Target
P2Y purinoceptor 14
Ligand
BDBM50596040
Substrate
Meas. Tech.
ChEMBL_2218979 (CHEMBL5132313)
IC50
4.8±n/a nM
Citation
 Zhou, MWang, WWang, ZWang, YZhu, YLin, ZTian, SHuang, YHu, QLi, H Discovery and computational studies of 2-phenyl-benzoxazole acetamide derivatives as promising P2Y Eur J Med Chem 227:0 (2022) Target
Name:
P2Y purinoceptor 14
Synonyms:
GPR105 KIAA0001 P2Y14_HUMAN | Purinergic receptor P2Y14
Type:
PROTEIN
Mol. Mass.:
38991.62
Organism:
Homo sapiens (Human)
Description:
ChEMBL_1502487
Residue:
338
  
Inhibitor
Name:
BDBM50596040
Synonyms:
CHEMBL5193065
Type:
Small organic molecule
Emp. Form.:
C22H15F3N2O3
Mol. Mass.:
412.3613
SMILES:
FC(F)(F)Oc1ccc(CC(=O)Nc2cccc(c2)-c2nc3ccccc3o2)cc1
: