Target
5-hydroxytryptamine receptor 2A
Ligand
BDBM50171272
Substrate
Meas. Tech.
ChEMBL_320948 (CHEMBL882467)
Ki
834±n/a nM
Citation
 Sard, HKumaran, GMorency, CRoth, BLToth, BAHe, PShuster, L SAR of psilocybin analogs: discovery of a selective 5-HT 2C agonist. Bioorg Med Chem Lett 15:4555-9 (2005)  
Target
Name:
5-hydroxytryptamine receptor 2A
Synonyms:
5-HT-2A 5-HT2A 5-hydroxytryptamine receptor 2A (5HT2A) Htr2 Serotonin Receptor 2A
Type:
G Protein-Coupled Receptor (GPCR)
Mol. Mass.:
52852.05
Organism:
Rattus norvegicus (rat)
Description:
Rat cortex membranes 5-HT2A receptors.
Residue:
471
  
Inhibitor
Name:
BDBM50171272
Synonyms:
3-Dimethylaminomethyl-1H-indol-4-ol | CHEMBL194588
Type:
Small organic molecule
Emp. Form.:
C11H14N2O
Mol. Mass.:
190.2417
SMILES:
CN(C)Cc1c[nH]c2cccc(O)c12
: