Target
Thromboxane A2 receptor
Ligand
BDBM50171472
Substrate
Meas. Tech.
ChEMBL_303672 (CHEMBL830433)
Ki
72.0±n/a nM
Citation
 Ohno, MMiyamoto, MHoshi, KTakeda, TYamada, NOhtake, A Development of dual-acting benzofurans for thromboxane A2 receptor antagonist and prostacyclin receptor agonist: synthesis, structure-activity relationship, and evaluation of benzofuran derivatives. J Med Chem 48:5279-94 (2005)  
Target
Name:
Thromboxane A2 receptor
Synonyms:
Prostanoid TP receptor TBXA2R Thromboxane Thromboxane Beta
Type:
Enyzme
Mol. Mass.:
37445.28
Organism:
Homo sapiens (Human)
Description:
P21731
Residue:
343
  
Inhibitor
Name:
BDBM50171472
Synonyms:
CHEMBL190840 | [3-[2-(1,1-Diphenyl-ethylsulfanyl)-ethyl]-2-(3-hydroxy-propyl)-benzofuran-7-yloxy]-acetic acid
Type:
Small organic molecule
Emp. Form.:
C29H30O5S
Mol. Mass.:
490.611
SMILES:
CC(SCCc1c(CCCO)oc2c(OCC(O)=O)cccc12)(c1ccccc1)c1ccccc1
: