Target
Thromboxane A2 receptor
Ligand
BDBM50171477
Substrate
Meas. Tech.
ChEMBL_303672 (CHEMBL830433)
Ki
26±n/a nM
Citation
 Ohno, MMiyamoto, MHoshi, KTakeda, TYamada, NOhtake, A Development of dual-acting benzofurans for thromboxane A2 receptor antagonist and prostacyclin receptor agonist: synthesis, structure-activity relationship, and evaluation of benzofuran derivatives. J Med Chem 48:5279-94 (2005)  
Target
Name:
Thromboxane A2 receptor
Synonyms:
Prostanoid TP receptor TBXA2R Thromboxane Thromboxane Beta
Type:
Enyzme
Mol. Mass.:
37445.28
Organism:
Homo sapiens (Human)
Description:
P21731
Residue:
343
  
Inhibitor
Name:
BDBM50171477
Synonyms:
CHEMBL191056 | {3-[2-(1,1-Diphenyl-ethylsulfanyl)-ethyl]-benzofuran-7-yloxy}-acetic acid
Type:
Small organic molecule
Emp. Form.:
C26H24O4S
Mol. Mass.:
432.531
SMILES:
CC(SCCc1coc2c(OCC(O)=O)cccc12)(c1ccccc1)c1ccccc1
: