Target
Peroxisome proliferator-activated receptor alpha
Ligand
BDBM50171992
Substrate
Meas. Tech.
ChEBML_310800
EC50
130±n/a nM
Citation
 Shi, GQDropinski, JFZhang, YSantini, CSahoo, SPBerger, JPMacnaul, KLZhou, GAgrawal, AAlvaro, RCai, TQHernandez, MWright, SDMoller, DEHeck, JVMeinke, PT Novel 2,3-dihydrobenzofuran-2-carboxylic acids: highly potent and subtype-selective PPARalpha agonists with potent hypolipidemic activity. J Med Chem 48:5589-99 (2005)  
Target
Name:
Peroxisome proliferator-activated receptor alpha
Synonyms:
NR1C1 PPAR PPAR-alpha PPARA_HUMAN Peroxisome proliferator-activated receptor | Peroxisome proliferator-activated receptor alpha (PPAR alpha)
Type:
Enzyme
Mol. Mass.:
52222.08
Organism:
Homo sapiens (Human)
Description:
Q07869
Residue:
468
  
Inhibitor
Name:
BDBM50171992
Synonyms:
(S)-5-{3-[2-Chloro-4-(3,3,3-trifluoro-propyl)-phenoxy]-propoxy}-2-ethyl-2,3-dihydro-benzofuran-2-carboxylic acid | CHEMBL190976
Type:
Small organic molecule
Emp. Form.:
C23H24ClF3O5
Mol. Mass.:
472.882
SMILES:
CC[C@]1(Cc2cc(OCCCOc3ccc(CCC(F)(F)F)cc3Cl)ccc2O1)C(O)=O
: