Target
5-hydroxytryptamine receptor 6
Ligand
BDBM50172272
Substrate
Meas. Tech.
ChEMBL_320876 (CHEMBL884801)
Ki
49±n/a nM
Citation
 Cole, DCLennox, WJStock, JREllingboe, JWMazandarani, HSmith, DLZhang, GTawa, GJSchechter, LE Conformationally constrained N1-arylsulfonyltryptamine derivatives as 5-HT6 receptor antagonists. Bioorg Med Chem Lett 15:4780-5 (2005)  
Target
Name:
5-hydroxytryptamine receptor 6
Synonyms:
5-HT-6 5-hydroxytryptamine receptor 6 (5-HT-6) 5-hydroxytryptamine receptor 6 (5HT6) HTR6 Serotonin 6 (5-HT6) receptor | Serotonin Receptor 6
Type:
G Protein-Coupled Receptor (GPCR)
Mol. Mass.:
46968.43
Organism:
Homo sapiens (Human)
Description:
P50406
Residue:
440
  
Inhibitor
Name:
BDBM50172272
Synonyms:
1-(3,4-Dichloro-benzenesulfonyl)-3-(S)-1-pyrrolidin-2-ylmethyl-1H-indole | CHEMBL436124
Type:
Small organic molecule
Emp. Form.:
C19H18Cl2N2O2S
Mol. Mass.:
409.329
SMILES:
Clc1ccc(cc1Cl)S(=O)(=O)n1cc(C[C@@H]2CCCN2)c2ccccc12
: