Target
Aminopeptidase N
Ligand
BDBM50022572
Substrate
Meas. Tech.
ChEMBL_325855 (CHEMBL863242)
Ki
10000±n/a nM
Citation
 Yang, KWGolich, FCSigdel, TKCrowder, MW Phosphinate, sulfonate, and sulfonamidate dipeptides as potential inhibitors of Escherichia coli aminopeptidase N. Bioorg Med Chem Lett 15:5150-3 (2005)  
Target
Name:
Aminopeptidase N
Synonyms:
AMPN_ECOLI | pepN
Type:
PROTEIN
Mol. Mass.:
98894.57
Organism:
Escherichia coli (strain K12)
Description:
ChEMBL_325855
Residue:
870
  
Inhibitor
Name:
BDBM50022572
Synonyms:
3-[(1-Amino-ethyl)-hydroxy-phosphinoyl]-2-methyl-propionic acid;hydrate CHEMBL2093127 | CHEMBL49180
Type:
Small organic molecule
Emp. Form.:
C6H14NO4P
Mol. Mass.:
195.1534
SMILES:
CC(CP(O)(O)C(C)=N)C(O)=O
: