Target
Carbonic anhydrase 9
Ligand
BDBM50174041
Substrate
Meas. Tech.
ChEMBL_320719 (CHEMBL881705)
Ki
16±n/a nM
Citation
 Ozensoy, OPuccetti, LFasolis, GArslan, OScozzafava, ASupuran, CT Carbonic anhydrase inhibitors: inhibition of the tumor-associated isozymes IX and XII with a library of aromatic and heteroaromatic sulfonamides. Bioorg Med Chem Lett 15:4862-6 (2005)  
Target
Name:
Carbonic anhydrase 9
Synonyms:
CA-IX CAH9_HUMAN Carbonic anhydrase 9 (CA IX) Carbonic anhydrase 9 precursor Carbonic anhydrase IX (CAIX) Carbonic anhydrases; II & IX MN RCC-associated antigen G250
Type:
Enzyme
Mol. Mass.:
49669.03
Organism:
Homo sapiens (Human)
Description:
Catalytic domain of human cloned isozyme was used in the assay
Residue:
459
  
Inhibitor
Name:
BDBM50174041
Synonyms:
5-(4-Nitro-cyclohexa-2,4-dienesulfinylamino)-[1,3,4]thiadiazole-2-sulfonic acid amide | CHEMBL382075
Type:
Small organic molecule
Emp. Form.:
C8H7N5O5S3
Mol. Mass.:
349.367
SMILES:
NS(=O)(=O)c1nnc(NS(=O)c2ccc(cc2)[N+]([O-])=O)s1
: