Target
Lysine-specific histone demethylase 1A
Ligand
BDBM50597543
Substrate
Meas. Tech.
ChEMBL_2223613 (CHEMBL5136947)
Ki
27±n/a nM
Citation
 Niwa, HWatanabe, CSato, SHarada, TWatanabe, HTabusa, RFukasawa, SShiobara, AHashimoto, TOhno, ONakamura, KTsuganezawa, KTanaka, AShirouzu, MHonma, TMatsuno, KUmehara, T Structure-Activity Relationship and  ACS Med Chem Lett 13:1485-1492 (2022) Target
Name:
Lysine-specific histone demethylase 1A
Synonyms:
AOF2 Flavin-containing amine oxidase domain-containing protein 2 KDM1A KIAA0601 Lysine-specific demethylase 1 (LSD1) Lysine-specific histone demethylase 1 (LSD1)
Type:
Enzyme
Mol. Mass.:
92901.01
Organism:
Homo sapiens (Human)
Description:
O60341
Residue:
852
  
Inhibitor
Name:
BDBM50597543
Synonyms:
CHEMBL5182939
Type:
Small organic molecule
Emp. Form.:
C9H8BrClFN
Mol. Mass.:
264.522
SMILES:
N[C@H]1C[C@@H]1c1cc(F)c(Br)cc1Cl
: