Target
Ectonucleotide pyrophosphatase/phosphodiesterase family member 3
Ligand
BDBM50597644
Substrate
Meas. Tech.
ChEMBL_2223760 (CHEMBL5137273)
Ki
30900±n/a nM
Citation
 Lee, SYNamasivayam, VBoshta, NMPerotti, AMirza, SBua, SSupuran, CTMüller, CE Discovery of potent nucleotide pyrophosphatase/phosphodiesterase3 (NPP3) inhibitors with ancillary carbonic anhydrase inhibition for cancer (immuno)therapy. RSC Med Chem 12:1187-1206 (2021) Target
Name:
Ectonucleotide pyrophosphatase/phosphodiesterase family member 3
Synonyms:
Alkaline phosphodiesterase I E-NPP 3 ENPP3_HUMAN NPPase PD-Ibeta Phosphodiesterase I beta | Phosphodiesterase I/nucleotide pyrophosphatase 3
Type:
PROTEIN
Mol. Mass.:
100124.29
Organism:
Homo sapiens (Human)
Description:
ChEMBL_101240
Residue:
875
  
Inhibitor
Name:
BDBM50597644
Synonyms:
CHEMBL5191332
Type:
Small organic molecule
Emp. Form.:
C25H22N6O2S2
Mol. Mass.:
502.611
SMILES:
CCc1nnc(s1)-c1cc(ccc1C)-c1nnc(Nc2ccc(cc2)S(N)(=O)=O)c2ccccc12
: