Target
Ectonucleotide pyrophosphatase/phosphodiesterase family member 3
Ligand
BDBM50179359
Substrate
Meas. Tech.
ChEMBL_2223772 (CHEMBL5137285)
Ki
710±n/a nM
Citation
 Lee, SYNamasivayam, VBoshta, NMPerotti, AMirza, SBua, SSupuran, CTMüller, CE Discovery of potent nucleotide pyrophosphatase/phosphodiesterase3 (NPP3) inhibitors with ancillary carbonic anhydrase inhibition for cancer (immuno)therapy. RSC Med Chem 12:1187-1206 (2021) Target
Name:
Ectonucleotide pyrophosphatase/phosphodiesterase family member 3
Synonyms:
Alkaline phosphodiesterase I E-NPP 3 ENPP3_HUMAN NPPase PD-Ibeta Phosphodiesterase I beta | Phosphodiesterase I/nucleotide pyrophosphatase 3
Type:
PROTEIN
Mol. Mass.:
100124.29
Organism:
Homo sapiens (Human)
Description:
ChEMBL_101240
Residue:
875
  
Inhibitor
Name:
BDBM50179359
Synonyms:
CHEBI:34946 | Reactive Blue 2
Type:
Small organic molecule
Emp. Form.:
C29H20ClN7O11S3
Mol. Mass.:
774.157
SMILES:
Nc1c(cc(Nc2ccc(Nc3nc(Cl)nc(Nc4cccc(c4)S(O)(=O)=O)n3)c(c2)S(O)(=O)=O)c2C(=O)c3ccccc3C(=O)c12)S(O)(=O)=O
: