Target
Ectonucleotide pyrophosphatase/phosphodiesterase family member 3
Ligand
BDBM50597650
Substrate
Meas. Tech.
ChEMBL_2223773 (CHEMBL5137286)
Ki
570±n/a nM
Citation
 Lee, SYNamasivayam, VBoshta, NMPerotti, AMirza, SBua, SSupuran, CTMüller, CE Discovery of potent nucleotide pyrophosphatase/phosphodiesterase3 (NPP3) inhibitors with ancillary carbonic anhydrase inhibition for cancer (immuno)therapy. RSC Med Chem 12:1187-1206 (2021) Target
Name:
Ectonucleotide pyrophosphatase/phosphodiesterase family member 3
Synonyms:
Alkaline phosphodiesterase I E-NPP 3 ENPP3_HUMAN NPPase PD-Ibeta Phosphodiesterase I beta | Phosphodiesterase I/nucleotide pyrophosphatase 3
Type:
PROTEIN
Mol. Mass.:
100124.29
Organism:
Homo sapiens (Human)
Description:
ChEMBL_101240
Residue:
875
  
Inhibitor
Name:
BDBM50597650
Synonyms:
CHEMBL5208063
Type:
Small organic molecule
Emp. Form.:
C24H22N4O2S
Mol. Mass.:
430.522
SMILES:
[#6]-[#6]-[#7]-1-[#6](=S)-[#7](-[#6]-[#6])-[#6](=O)\[#6](=[#6]/c2cn(nc2-c2ccccc2)-c2ccccc2)-[#6]-1=O
: