Target
Replicase polyprotein 1ab
Ligand
BDBM419133
Substrate
Meas. Tech.
ChEMBL_2224055 (CHEMBL5137568)
IC50
30±n/a nM
Citation
 Cannalire, RCerchia, CBeccari, ARDi Leva, FSSumma, V Targeting SARS-CoV-2 Proteases and Polymerase for COVID-19 Treatment: State of the Art and Future Opportunities. J Med Chem 65:2716-2746 (2022) Target
Name:
Replicase polyprotein 1ab
Synonyms:
ORF1ab polyprotein pp1ab | rep
Type:
Protein
Mol. Mass.:
794070.71
Organism:
2019-nCoV
Description:
P0DTD1
Residue:
7096
  
Inhibitor
Name:
BDBM419133
Synonyms:
BDBM429386 | GC376
Type:
Small organic molecule
Emp. Form.:
C21H30N3O8S
Mol. Mass.:
484.544
SMILES:
CC(C)C[C@H](NC(=O)OCc1ccccc1)C(=O)N[C@@H](C[C@@H]1CCNC1=O)C(O)S([O-])(=O)=O
: