Target
Platelet-derived growth factor receptor alpha
Ligand
BDBM50004227
Substrate
Meas. Tech.
ChEMBL_321286 (CHEMBL856815)
IC50
600±n/a nM
Citation
 Vendôme, JLetard, SMartin, FSvinarchuk, FDubreuil, PAuclair, CLe Bret, M Molecular modeling of wild-type and D816V c-Kit inhibition based on ATP-competitive binding of ellipticine derivatives to tyrosine kinases. J Med Chem 48:6194-201 (2005)  
Target
Name:
Platelet-derived growth factor receptor alpha
Synonyms:
Alpha-type platelet-derived growth factor receptor PDGFRA PGFRA_HUMAN Platelet-derived growth factor receptor alpha (PDGFRA) RHEPDGFRA
Type:
Protein
Mol. Mass.:
122633.38
Organism:
Homo sapiens (Human)
Description:
P16234
Residue:
1089
  
Inhibitor
Name:
BDBM50004227
Synonyms:
5,11-Dimethyl-6H-pyrido[4,3-b]carbazol-9-ol CHEMBL26559
Type:
Small organic molecule
Emp. Form.:
C17H14N2O
Mol. Mass.:
262.3059
SMILES:
Cc1c2[nH]c3ccc(O)cc3c2c(C)c2cnccc12
: