Target
Protein arginine N-methyltransferase 1
Ligand
BDBM50015234
Substrate
Meas. Tech.
ChEMBL_2224717 (CHEMBL5138230)
IC50
52000±n/a nM
Citation
 Talukdar, AMukherjee, ABhattacharya, D Fascinating Transformation of SAM-Competitive Protein Methyltransferase Inhibitors from Nucleoside Analogues to Non-Nucleoside Analogues. J Med Chem 65:1662-1684 (2022) Target
Name:
Protein arginine N-methyltransferase 1
Synonyms:
2.1.1.319 HMT2 HRMT1L2 {ECO:0000303|PubMed:11097842 IR1B4 PRMT1 Protein-arginine N-methyltransferase 1 | Synonyms=HMT2
Type:
PROTEIN
Mol. Mass.:
42451.61
Organism:
Homo sapiens
Description:
ChEMBL_100878
Residue:
371
  
Inhibitor
Name:
BDBM50015234
Synonyms:
4,4''[1,6-HEXANEDIYLBIS(OXY)]BISBENZENECARBOXIMIDAMIDE 4-{6-[4-amino(imino)methylphenoxy]hexyloxy}phenyl-iminomethanamine CHEMBL25105 US9138393, Hexamidine diisethionate | US9144538, Hexamidine diisethionate
Type:
Small organic molecule
Emp. Form.:
C20H26N4O2
Mol. Mass.:
354.446
SMILES:
NC(=N)c1ccc(OCCCCCCOc2ccc(cc2)C(N)=N)cc1
: