Target
Protein arginine N-methyltransferase 5
Ligand
BDBM50597881
Substrate
Meas. Tech.
ChEMBL_2224736 (CHEMBL5138249)
IC50
0.400000±n/a nM
Citation
 Talukdar, AMukherjee, ABhattacharya, D Fascinating Transformation of SAM-Competitive Protein Methyltransferase Inhibitors from Nucleoside Analogues to Non-Nucleoside Analogues. J Med Chem 65:1662-1684 (2022) Target
Name:
Protein arginine N-methyltransferase 5
Synonyms:
72 kDa ICln-binding protein HRMT1L5 IBP72 Jak-binding protein 1 PRMT5/MEP50 complex Protein arginine methyltransferase 5 (PRMT5) SKB1 homolog Shk1 kinase-binding protein 1 homolog
Type:
Enzyme
Mol. Mass.:
72679.99
Organism:
Homo sapiens (Human)
Description:
O14744
Residue:
637
  
Inhibitor
Name:
BDBM50597881
Synonyms:
CHEMBL5187591
Type:
Small organic molecule
Emp. Form.:
C19H24N6O2
Mol. Mass.:
368.4329
SMILES:
Nc1cccc(CCC[C@@H]2C[C@@H]([C@@H](O)[C@H]2O)n2ccc3c(N)ncnc23)n1
: