Target
L-lactate dehydrogenase A chain
Ligand
BDBM50597913
Substrate
Meas. Tech.
ChEMBL_2224765 (CHEMBL5138278)
IC50
2.5±n/a nM
Citation
 Wei, BRobarge, KLabadie, SSChen, JCorson, LBDiPasquale, ADragovich, PSEigenbrot, CEvangelista, MFauber, BPHitz, AHong, RLai, KWLiu, WMa, SMalek, SO'Brien, TPang, JPeterson, DSalphati, LSampath, DSideris, SUltsch, MXu, ZYen, IYu, DYue, QZhou, APurkey, HE Structure-based optimization of hydroxylactam as potent, cell-active inhibitors of lactate dehydrogenase. Bioorg Med Chem Lett 59:0 (2022) Target
Name:
L-lactate dehydrogenase A chain
Synonyms:
Cell proliferation-inducing gene 19 protein L-lactate dehydrogenase A Chain LDH-A LDHA Lactate dehydrogenase A (LDHA) | Renal carcinoma antigen NY-REN-59
Type:
Protein
Mol. Mass.:
36694.85
Organism:
Homo sapiens (Human)
Description:
P00338::PDB Code: 4ajp
Residue:
332
  
Inhibitor
Name:
BDBM50597913
Synonyms:
CHEMBL5194549
Type:
Small organic molecule
Emp. Form.:
C33H23ClF2N4O3S
Mol. Mass.:
629.076
SMILES:
OC1=C(Sc2ccccc2Cl)C(=O)NC(C1)(c1cccc(Nc2ccc(F)c(F)c2)n1)c1cccc(Oc2ccccc2)n1
: