Target
L-lactate dehydrogenase A chain
Ligand
BDBM50597916
Substrate
Meas. Tech.
ChEMBL_2224765 (CHEMBL5138278)
IC50
1.8±n/a nM
Citation
 Wei, BRobarge, KLabadie, SSChen, JCorson, LBDiPasquale, ADragovich, PSEigenbrot, CEvangelista, MFauber, BPHitz, AHong, RLai, KWLiu, WMa, SMalek, SO'Brien, TPang, JPeterson, DSalphati, LSampath, DSideris, SUltsch, MXu, ZYen, IYu, DYue, QZhou, APurkey, HE Structure-based optimization of hydroxylactam as potent, cell-active inhibitors of lactate dehydrogenase. Bioorg Med Chem Lett 59:0 (2022) Target
Name:
L-lactate dehydrogenase A chain
Synonyms:
Cell proliferation-inducing gene 19 protein L-lactate dehydrogenase A Chain LDH-A LDHA Lactate dehydrogenase A (LDHA) | Renal carcinoma antigen NY-REN-59
Type:
Protein
Mol. Mass.:
36694.85
Organism:
Homo sapiens (Human)
Description:
P00338::PDB Code: 4ajp
Residue:
332
  
Inhibitor
Name:
BDBM50597916
Synonyms:
CHEMBL5201115
Type:
Small organic molecule
Emp. Form.:
C32H27ClFN3O4S
Mol. Mass.:
604.091
SMILES:
OC1=C(Sc2ccccc2Cl)C(=O)NC(C1)(c1ccc(cc1)N1CCOCC1)c1cccc(Oc2ccc(F)cc2)n1
: