Target
Histone deacetylase 1
Ligand
BDBM36184
Substrate
Meas. Tech.
ChEMBL_2224817 (CHEMBL5138330)
IC50
162000±n/a nM
Citation
 Barone, SCassese, EAlfano, AIBrindisi, MSumma, V Chasing a Breath of Fresh Air in Cystic Fibrosis (CF): Therapeutic Potential of Selective HDAC6 Inhibitors to Tackle Multiple Pathways in CF Pathophysiology. J Med Chem 65:3080-3097 (2022) Target
Name:
Histone deacetylase 1
Synonyms:
Cereblon/Histone deacetylase 1 HDAC1 Histone deacetylase 1 (HDAC1) RPD3L1
Type:
Enzyme
Mol. Mass.:
55090.27
Organism:
Homo sapiens (Human)
Description:
Q13547
Residue:
482
  
Inhibitor
Name:
BDBM36184
Synonyms:
4-phenylbutanoate
Type:
Guest
Emp. Form.:
C10H11O2
Mol. Mass.:
163.1937
SMILES:
[O-]C(=O)CCCc1ccccc1
: