Target
Estrogen receptor beta
Ligand
BDBM50174924
Substrate
Meas. Tech.
ChEMBL_325825 (CHEMBL863237)
IC50
2.3±n/a nM
Citation
 Blizzard, TAMorgan, JDChan, WBirzin, ETPai, LYHayes, ECDaSilva, CAMosley, RTYang, YTRohrer, SPDininno, FHammond, ML Estrogen receptor ligands. Part 14: application of novel antagonist side chains to existing platforms. Bioorg Med Chem Lett 15:5124-8 (2005)  
Target
Name:
Estrogen receptor beta
Synonyms:
ER-beta ESR2_HUMAN Estradiol receptor beta (ERβ) Estrogen receptor (ER beta) Estrogen receptor beta (ER beta) NR3A2 estrogen beta
Type:
Protein
Mol. Mass.:
59238.43
Organism:
Homo sapiens (Human)
Description:
Q92731
Residue:
530
  
Inhibitor
Name:
BDBM50174924
Synonyms:
(S)-1-(4-(2-(pyrrolidin-1-yl)propoxy)benzyl)-2-(4-hydroxyphenyl)-3-methyl-1H-indol-5-ol | CHEMBL372808
Type:
Small organic molecule
Emp. Form.:
C29H32N2O3
Mol. Mass.:
456.576
SMILES:
C[C@@H](COc1ccc(Cn2c(c(C)c3cc(O)ccc23)-c2ccc(O)cc2)cc1)N1CCCC1
: