Target
Estrogen receptor
Ligand
BDBM50174924
Substrate
Meas. Tech.
ChEMBL_325824 (CHEMBL863236)
IC50
0.4±n/a nM
Citation
 Blizzard, TAMorgan, JDChan, WBirzin, ETPai, LYHayes, ECDaSilva, CAMosley, RTYang, YTRohrer, SPDininno, FHammond, ML Estrogen receptor ligands. Part 14: application of novel antagonist side chains to existing platforms. Bioorg Med Chem Lett 15:5124-8 (2005)  
Target
Name:
Estrogen receptor
Synonyms:
ER ESR ESR1_HUMAN Estrogen receptor Estrogen receptor (ER-alpha) Estrogen receptor alpha (ER) Nuclear receptor subfamily 3 group A member 1
Type:
Protein
Mol. Mass.:
66230.44
Organism:
Homo sapiens (Human)
Description:
P03372
Residue:
595
  
Inhibitor
Name:
BDBM50174924
Synonyms:
(S)-1-(4-(2-(pyrrolidin-1-yl)propoxy)benzyl)-2-(4-hydroxyphenyl)-3-methyl-1H-indol-5-ol | CHEMBL372808
Type:
Small organic molecule
Emp. Form.:
C29H32N2O3
Mol. Mass.:
456.576
SMILES:
C[C@@H](COc1ccc(Cn2c(c(C)c3cc(O)ccc23)-c2ccc(O)cc2)cc1)N1CCCC1
: