Target
ALK tyrosine kinase receptor
Ligand
BDBM245217
Substrate
Meas. Tech.
ChEMBL_2226745 (CHEMBL5140258)
IC50
260±n/a nM
Citation
 Mologni, LOrsato, AZambon, ATardy, SBisson, WHSchneider, CCeccon, MViltadi, MD'Attoma, JPannilunghi, SVece, VGueyrard, DBertho, JScapozza, LGoekjian, PGambacorti-Passerini, C Identification of non-ATP-competitive ?-carboline inhibitors of the anaplastic lymphoma kinase. Eur J Med Chem 238:0 (2022) Target
Name:
ALK tyrosine kinase receptor
Synonyms:
ALK ALK_HUMAN CD_antigen: CD246
Type:
Protein
Mol. Mass.:
176453.10
Organism:
Homo sapiens (Human)
Description:
Q9UM73
Residue:
1620
  
Inhibitor
Name:
BDBM245217
Synonyms:
US9428500, 11
Type:
Small organic molecule
Emp. Form.:
C31H27F3N4
Mol. Mass.:
512.5681
SMILES:
CN1CCN(CC1)c1ccc(cc1)-c1ccc2[nH]c3nccc(\C=C\c4ccccc4C(F)(F)F)c3c2c1
: