Target
Inhibitor of nuclear factor kappa-B kinase subunit alpha/Inhibitor of nuclear factor kappa-B kinase subunit beta/NF-kappa-B essential modulator
Ligand
BDBM50175694
Substrate
Meas. Tech.
ChEMBL_327454 (CHEMBL861784)
IC50
8500±n/a nM
Citation
 Waelchli, RBollbuck, BBruns, CBuhl, TEder, JFeifel, RHersperger, RJanser, PRevesz, LZerwes, HGSchlapbach, A Design and preparation of 2-benzamido-pyrimidines as inhibitors of IKK. Bioorg Med Chem Lett 16:108-12 (2005)  
Target
Name:
Inhibitor of nuclear factor kappa-B kinase subunit alpha/Inhibitor of nuclear factor kappa-B kinase subunit beta/NF-kappa-B essential modulator
Synonyms:
I-kappa-B Kinase 1 (IKK-alpha)/I-kappa-B Kinase 2 (IKK-beta)/NF-kappa-B essential modulator | Inhibitor of NF-kappa-B kinase (IKK)
Type:
Mol. Mass.:
Description:
ASSAY_ID of EBI is 327454
Components:
This complex has 3 components.
Component 1
Name:
Inhibitor of nuclear factor kappa-B kinase subunit alpha
Synonyms:
CHUK I-kappa-B kinase 1 IKK-A IKK1 IKKA IkBKA Inhibitor of NF-kappa-B kinase alpha/beta Nuclear factor NF-kappa-B inhibitor kinase alpha TCF16 | Transcription factor 16
Type:
PROTEIN
Mol. Mass.:
84642.21
Organism:
Homo sapiens (Human)
Description:
ChEMBL_327453
Residue:
745
  
Component 2
Name:
Inhibitor of nuclear factor kappa-B kinase subunit beta
Synonyms:
I-kappa-B Kinase 2 (IKK-beta) I-kappa-B-kinase beta IKBKB IKK-beta IKK2/IKK1 IKKB_HUMAN Inhibitor of nuclear factor kappa B kinase beta subunit Nuclear factor NF-kappa-B inhibitor kinase beta
Type:
Serine/threonine-protein kinase
Mol. Mass.:
86554.39
Organism:
Homo sapiens (Human)
Description:
GST-tagged IKK-2 was expressed in High Five cells and purified.
Residue:
756
  
Component 3
Name:
NF-kappa-B essential modulator
Synonyms:
FIP3 Inhibitor of NF-kappa-B kinase (IKK) NEMO_HUMAN | NF-kappa-B essential modulator
Type:
PROTEIN
Mol. Mass.:
48190.12
Organism:
Homo sapiens (Human)
Description:
ChEMBL_84013
Residue:
419
  
Component 4
Name:
Inhibitor of nuclear factor kappa-B kinase subunit alpha
Synonyms:
CHUK I-kappa-B kinase 1 IKK-A IKK1 IKKA IkBKA Inhibitor of NF-kappa-B kinase alpha/beta Nuclear factor NF-kappa-B inhibitor kinase alpha TCF16 | Transcription factor 16
Type:
PROTEIN
Mol. Mass.:
84642.21
Organism:
Homo sapiens (Human)
Description:
ChEMBL_327453
Residue:
745
  
Inhibitor
Name:
BDBM50175694
Synonyms:
(4-(4-(benzo[b]thiophen-2-yl)pyrimidin-2-ylamino)phenyl)(pyrrolidin-1-yl)methanone | CHEMBL382752
Type:
Small organic molecule
Emp. Form.:
C23H20N4OS
Mol. Mass.:
400.496
SMILES:
O=C(N1CCCC1)c1ccc(Nc2nccc(n2)-c2cc3ccccc3s2)cc1
: