Target
Inhibitor of nuclear factor kappa-B kinase subunit alpha
Ligand
BDBM50175694
Substrate
Meas. Tech.
ChEMBL_327453 (CHEMBL859877)
IC50
3800±n/a nM
Citation
 Waelchli, RBollbuck, BBruns, CBuhl, TEder, JFeifel, RHersperger, RJanser, PRevesz, LZerwes, HGSchlapbach, A Design and preparation of 2-benzamido-pyrimidines as inhibitors of IKK. Bioorg Med Chem Lett 16:108-12 (2005)  
Target
Name:
Inhibitor of nuclear factor kappa-B kinase subunit alpha
Synonyms:
CHUK I-kappa-B kinase 1 IKK-A IKK1 IKKA IkBKA Inhibitor of NF-kappa-B kinase alpha/beta Nuclear factor NF-kappa-B inhibitor kinase alpha TCF16 | Transcription factor 16
Type:
PROTEIN
Mol. Mass.:
84642.21
Organism:
Homo sapiens (Human)
Description:
ChEMBL_327453
Residue:
745
  
Inhibitor
Name:
BDBM50175694
Synonyms:
(4-(4-(benzo[b]thiophen-2-yl)pyrimidin-2-ylamino)phenyl)(pyrrolidin-1-yl)methanone | CHEMBL382752
Type:
Small organic molecule
Emp. Form.:
C23H20N4OS
Mol. Mass.:
400.496
SMILES:
O=C(N1CCCC1)c1ccc(Nc2nccc(n2)-c2cc3ccccc3s2)cc1
: