Target
Nuclear receptor subfamily 4 group A member 2
Ligand
BDBM50139181
Substrate
Meas. Tech.
ChEMBL_2227572 (CHEMBL5141085)
EC50
5100±n/a nM
Citation
 Willems, SMerk, D Medicinal Chemistry and Chemical Biology of Nurr1 Modulators: An Emerging Strategy in Neurodegeneration. J Med Chem 65:9548-9563 (2022) Target
Name:
Nuclear receptor subfamily 4 group A member 2
Synonyms:
NOT NR4A2_HUMAN TINUR
Type:
PROTEIN
Mol. Mass.:
66603.77
Organism:
Homo sapiens (Human)
Description:
ChEMBL_453027
Residue:
598
  
Inhibitor
Name:
BDBM50139181
Synonyms:
(1S,3R,7S,8S,8aR)-8-{2-[(2R,4R)-4-hydroxy-6-oxotetrahydro-2H-pyran-2-yl]ethyl}-3,7-dimethyl-1,2,3,7,8,8a-hexahydronaphthalen-1-yl 2,2-dimethylbutanoate MK-733 Simvastatin cid_54454
Type:
Small organic molecule
Emp. Form.:
C25H38O5
Mol. Mass.:
418.5662
SMILES:
CCC(C)(C)C(=O)O[C@H]1C[C@@H](C)C=C2C=C[C@H](C)[C@H](CC[C@@H]3C[C@@H](O)CC(=O)O3)[C@@H]12
: