Target
Lysine-specific demethylase 5B
Ligand
BDBM50513343
Substrate
Meas. Tech.
ChEMBL_2227634 (CHEMBL5141147)
Ki
7.0±n/a nM
Citation
 Wu, QYoung, BWang, YDavidoff, AMRankovic, ZYang, J Recent Advances with KDM4 Inhibitors and Potential Applications. J Med Chem 65:9564-9579 (2022) Target
Name:
Lysine-specific demethylase 5B
Synonyms:
CT31 Histone demethylase JARID1B Jumonji/ARID domain-containing protein 1B KDM5B_HUMAN Lysine-specific demethylase 5B (KDM5Flag-5B-FL) PLU1 RBP2-H1 | Retinoblastoma-binding protein 2 homolog 1
Type:
Protein
Mol. Mass.:
175659.67
Organism:
Homo sapiens (Human)
Description:
Q9UGL1
Residue:
1544
  
Inhibitor
Name:
BDBM50513343
Synonyms:
CHEMBL4449500
Type:
Small organic molecule
Emp. Form.:
C25H26N6O
Mol. Mass.:
426.5135
SMILES:
O=c1[nH]cnc2c(nccc12)-n1cc(CCN2CCC3(CCc4ccccc34)CC2)cn1
: