Target
Histamine H3 receptor
Ligand
BDBM50175839
Substrate
Meas. Tech.
ChEMBL_327753 (CHEMBL861794)
Ki
4±n/a nM
Citation
 Vaccaro, WDSher, RBerlin, MShih, NYAslanian, RSchwerdt, JHMcCormick, KDPiwinski, JJWest, REAnthes, JCWilliams, SMWu, RLShe, HSRivelli, MAMutter, JCCorboz, MRHey, JAFavreau, L Novel histamine H3 receptor antagonists based on the 4-[(1H-imidazol-4-yl)methyl]piperidine scaffold. Bioorg Med Chem Lett 16:395-9 (2005)  
Target
Name:
Histamine H3 receptor
Synonyms:
HISTAMINE H3 HRH3_CAVPO | Histamine H3 receptor
Type:
Enzyme Catalytic Domain
Mol. Mass.:
48753.61
Organism:
GUINEA PIG
Description:
HISTAMINE H3 HRH3 GUINEA PIG::Q9JI35
Residue:
445
  
Inhibitor
Name:
BDBM50175839
Synonyms:
4-((1H-imidazol-4-yl)methyl)-1-(3-phenoxypropyl)piperidine | CHEMBL200267
Type:
Small organic molecule
Emp. Form.:
C18H25N3O
Mol. Mass.:
299.4106
SMILES:
C(COc1ccccc1)CN1CCC(Cc2cnc[nH]2)CC1
: