Target
Malonyl-CoA decarboxylase, mitochondrial
Ligand
BDBM50176175
Substrate
Meas. Tech.
ChEMBL_330757 (CHEMBL861921)
IC50
107000±n/a nM
Citation
 Cheng, JFChen, MLiu, BHou, ZArrhenius, TNadzan, AM Design and synthesis of heterocyclic malonyl-CoA decarboxylase inhibitors. Bioorg Med Chem Lett 16:695-700 (2005)  
Target
Name:
Malonyl-CoA decarboxylase, mitochondrial
Synonyms:
DCMC_HUMAN Malonyl-CoA decarboxylase
Type:
PROTEIN
Mol. Mass.:
55018.37
Organism:
Homo sapiens (Human)
Description:
ChEMBL_665404
Residue:
493
  
Inhibitor
Name:
BDBM50176175
Synonyms:
5-((1-(4-(1,1,1,3,3,3-hexafluoro-2-hydroxypropan-2-yl)phenyl)-2-isopropyl-1H-imidazol-5-yl)methoxy)pentanenitrile | CHEMBL440043
Type:
Small organic molecule
Emp. Form.:
C21H23F6N3O2
Mol. Mass.:
463.4166
SMILES:
CC(C)c1ncc(COCCCCC#N)n1-c1ccc(cc1)C(O)(C(F)(F)F)C(F)(F)F
: