Target
Renin
Ligand
BDBM50598965
Substrate
Meas. Tech.
ChEMBL_2228778 (CHEMBL5142291)
IC50
1.7±n/a nM
Citation
 Iijima, DSugama, HTakahashi, YHirai, MTogashi, YXie, JShen, JKe, YAkatsuka, HKawaguchi, TTakedomi, KKashima, ANishio, MInui, YYoneda, HXia, GIijima, T Discovery of SPH3127: A Novel, Highly Potent, and Orally Active Direct Renin Inhibitor. J Med Chem 65:10882-10897 (2022) Target
Name:
Renin
Synonyms:
Angiotensinogenase RENI_HUMAN
Type:
Enzyme
Mol. Mass.:
45058.99
Organism:
Homo sapiens (Human)
Description:
Residue:
406
  
Inhibitor
Name:
BDBM50598965
Synonyms:
CHEMBL5188936
Type:
Small organic molecule
Emp. Form.:
C21H30N6O4
Mol. Mass.:
430.5007
SMILES:
COC(=O)NCCCn1cc([C@@H](C)N(C2CC2)C(=O)[C@H]2CNCCO2)c2nccnc12
: