Target
Renin
Ligand
BDBM212579
Substrate
Meas. Tech.
ChEMBL_2228778 (CHEMBL5142291)
IC50
0.400000±n/a nM
Citation
 Iijima, DSugama, HTakahashi, YHirai, MTogashi, YXie, JShen, JKe, YAkatsuka, HKawaguchi, TTakedomi, KKashima, ANishio, MInui, YYoneda, HXia, GIijima, T Discovery of SPH3127: A Novel, Highly Potent, and Orally Active Direct Renin Inhibitor. J Med Chem 65:10882-10897 (2022) Target
Name:
Renin
Synonyms:
Angiotensinogenase RENI_HUMAN
Type:
Enzyme
Mol. Mass.:
45058.99
Organism:
Homo sapiens (Human)
Description:
Residue:
406
  
Inhibitor
Name:
BDBM212579
Synonyms:
US10155731, Example 270 | US9278944, 270
Type:
Small organic molecule
Emp. Form.:
C22H32N6O4
Mol. Mass.:
444.5273
SMILES:
COC(=O)NCCCn1nc([C@@H](C)N(C2CC2)C(=O)[C@H]2CNCCO2)c2ccc(C)nc12
: